Target
Carbonic anhydrase 2
Ligand
BDBM26986
Substrate
Meas. Tech.
ChEMBL_748879 (CHEMBL1781043)
pH
8.3±n/a
Ki
85000000±n/a nM
Comments
extracted
Citation
 Vullo, DNishimori, IMinakuchi, TScozzafava, ASupuran, CT Inhibition studies with anions and small molecules of two novel β-carbonic anhydrases from the bacterial pathogen Salmonella enterica serovar Typhimurium. Bioorg Med Chem Lett 21:3591-5 (2011)  
Target
Name:
Carbonic anhydrase 2
Synonyms:
CA-II CAC Carbonate dehydratase II Carbonic anhydrase 2 (CA-II) Carbonic anhydrase C Carbonic anhydrase II (CA-II) Carbonic anhydrase II (hCA II) | Carbonic anhydrase isoenzyme II (hCA II)
Type:
Enzyme
Mol. Mass.:
29250.71
Organism:
Homo sapiens (Human)
Description:
P00918
Residue:
260
  
Inhibitor
Name:
BDBM26986
Synonyms:
CHEMBL363707 SODIUM BICARBONATE hydrogen carbonate
Type:
Ion
Emp. Form.:
CHO3
Mol. Mass.:
61.0174
SMILES:
OC([O-])=O
: