Target
Carbonic anhydrase 2
Ligand
BDBM50345226
Substrate
Meas. Tech.
ChEMBL_751965 (CHEMBL1785907)
Ki
33.8±n/a nM
Citation
 Hen, NBialer, MYagen, BMaresca, AAggarwal, MRobbins, AHMcKenna, RScozzafava, ASupuran, CT Anticonvulsant 4-aminobenzenesulfonamide derivatives with branched-alkylamide moieties: X-ray crystallography and inhibition studies of human carbonic anhydrase isoforms I, II, VII, and XIV. J Med Chem 54:3977-81 (2011)  
Target
Name:
Carbonic anhydrase 2
Synonyms:
CA-II CAC Carbonate dehydratase II Carbonic anhydrase 2 (CA-II) Carbonic anhydrase C Carbonic anhydrase II (CA-II) Carbonic anhydrase II (hCA II) | Carbonic anhydrase isoenzyme II (hCA II)
Type:
Enzyme
Mol. Mass.:
29250.71
Organism:
Homo sapiens (Human)
Description:
P00918
Residue:
260
  
Inhibitor
Name:
BDBM50345226
Synonyms:
2-Ethyl-N-[2-(4-sulfamoylphenyl)ethyl]butyramide CHEMBL1082898
Type:
Small organic molecule
Emp. Form.:
C14H22N2O3S
Mol. Mass.:
298.401
SMILES:
CCC(CC)C(=O)NCCc1ccc(cc1)S(N)(=O)=O
: