Target
Metabotropic glutamate receptor 5
Ligand
BDBM50345955
Substrate
Meas. Tech.
ChEMBL_749915 (CHEMBL1786745)
IC50
>3000±n/a nM
Citation
 Sasikumar, TKQiang, LBurnett, DAGreenlee, WJLi, CHeimark, LPramanik, BGrilli, MBertorelli, RLozza, GReggiani, A Tricyclic thienopyridine-pyrimidones/thienopyrimidine-pyrimidones as orally efficacious mGluR1 antagonists for neuropathic pain. Bioorg Med Chem Lett 19:3199-203 (2009)  
Target
Name:
Metabotropic glutamate receptor 5
Synonyms:
GPRC1E GRM5_HUMAN metabotropic glutamate 5 | metabotropic glutamate 5a
Type:
Enzyme
Mol. Mass.:
132484.72
Organism:
Homo sapiens (Human)
Description:
Residue:
1212
  
Inhibitor
Name:
BDBM50345955
Synonyms:
3-(4-Chloro-phenyl)-9-(2-methyl-allylamino)-3H-thieno[2,3-d:4,5-d']dipyrimidin-4-one | CHEMBL1784054
Type:
Small organic molecule
Emp. Form.:
C18H14ClN5OS
Mol. Mass.:
383.855
SMILES:
CC(=C)CNc1ncnc2sc3c(ncn(-c4ccc(Cl)cc4)c3=O)c12
: