Target
cAMP-specific 3',5'-cyclic phosphodiesterase 4B
Ligand
BDBM50346112
Substrate
Meas. Tech.
ChEMBL_750541 (CHEMBL1786302)
IC50
78±n/a nM
Citation
 Naganuma, KOmura, AMaekawara, NSaitoh, MOhkawa, NKubota, TNagumo, HKodama, TTakemura, MOhtsuka, YNakamura, JTsujita, RKawasaki, KYokoi, HKawanishi, M Discovery of selective PDE4B inhibitors. Bioorg Med Chem Lett 19:3174-6 (2009)  
Target
Name:
cAMP-specific 3',5'-cyclic phosphodiesterase 4B
Synonyms:
3',5'-cyclic phosphodiesterase Isoform PDE4B1 PDE4B PDE4B_HUMAN Phosphodiesterase 4B (PDE4B) Phosphodiesterase Type 4 (PDE4B)
Type:
Protein
Mol. Mass.:
83318.87
Organism:
Homo sapiens (Human)
Description:
Q07343
Residue:
736
  
Inhibitor
Name:
BDBM50346112
Synonyms:
4-(5-allyl-2-(5-methoxythiophen-2-yl)-6-methylpyrimidin-4-ylamino)benzoic acid | CHEMBL1782298
Type:
Small organic molecule
Emp. Form.:
C20H19N3O3S
Mol. Mass.:
381.448
SMILES:
COc1ccc(s1)-c1nc(C)c(CC=C)c(Nc2ccc(cc2)C(O)=O)n1
: