Target
cAMP-specific 3',5'-cyclic phosphodiesterase 4B
Ligand
BDBM50346114
Substrate
Meas. Tech.
ChEMBL_750541 (CHEMBL1786302)
IC50
940±n/a nM
Citation
 Naganuma, KOmura, AMaekawara, NSaitoh, MOhkawa, NKubota, TNagumo, HKodama, TTakemura, MOhtsuka, YNakamura, JTsujita, RKawasaki, KYokoi, HKawanishi, M Discovery of selective PDE4B inhibitors. Bioorg Med Chem Lett 19:3174-6 (2009)  
Target
Name:
cAMP-specific 3',5'-cyclic phosphodiesterase 4B
Synonyms:
3',5'-cyclic phosphodiesterase Isoform PDE4B1 PDE4B PDE4B_HUMAN Phosphodiesterase 4B (PDE4B) Phosphodiesterase Type 4 (PDE4B)
Type:
Protein
Mol. Mass.:
83318.87
Organism:
Homo sapiens (Human)
Description:
Q07343
Residue:
736
  
Inhibitor
Name:
BDBM50346114
Synonyms:
2-(4-(5-allyl-6-methyl-2-p-tolylpyrimidin-4-ylamino)phenyl)acetic acid | CHEMBL1782300
Type:
Small organic molecule
Emp. Form.:
C23H23N3O2
Mol. Mass.:
373.4476
SMILES:
Cc1ccc(cc1)-c1nc(C)c(CC=C)c(Nc2ccc(CC(O)=O)cc2)n1
: