Target
cAMP-specific 3',5'-cyclic phosphodiesterase 4D
Ligand
BDBM50346098
Substrate
Meas. Tech.
ChEMBL_750542 (CHEMBL1786303)
IC50
1500±n/a nM
Citation
 Naganuma, KOmura, AMaekawara, NSaitoh, MOhkawa, NKubota, TNagumo, HKodama, TTakemura, MOhtsuka, YNakamura, JTsujita, RKawasaki, KYokoi, HKawanishi, M Discovery of selective PDE4B inhibitors. Bioorg Med Chem Lett 19:3174-6 (2009)  
Target
Name:
cAMP-specific 3',5'-cyclic phosphodiesterase 4D
Synonyms:
3',5'-cyclic phosphodiesterase PDE43 PDE4D_HUMAN | Phosphodiesterase 4D
Type:
Protein
Mol. Mass.:
91092.69
Organism:
Homo sapiens (Human)
Description:
Q08499
Residue:
809
  
Inhibitor
Name:
BDBM50346098
Synonyms:
4-(5-formyl-6-methyl-2-phenylpyrimidin-4-ylamino)benzoic acid | CHEMBL1784116
Type:
Small organic molecule
Emp. Form.:
C19H15N3O3
Mol. Mass.:
333.3407
SMILES:
Cc1nc(nc(Nc2ccc(cc2)C(O)=O)c1C=O)-c1ccccc1
: