Target
5-hydroxytryptamine receptor 2A
Ligand
BDBM50346381
Substrate
Meas. Tech.
ChEMBL_750209 (CHEMBL1787902)
Ki
172±n/a nM
Citation
 Fiorino, FMagli, EPerissutti, ESeverino, BFrecentese, FEsposito, ADe Angelis, FIncisivo, GMMassarelli, PNencini, CDi Gennaro, EBudillon, ADi Cintio, ASantagada, VCaliendo, G Synthesis of 1-naphtylpiperazine derivatives as serotoninergic ligands and their evaluation as antiproliferative agents. Eur J Med Chem 46:2206-16 (2011)  
Target
Name:
5-hydroxytryptamine receptor 2A
Synonyms:
5-HT-2A 5-HT2A 5-hydroxytryptamine receptor 2A (5HT2A) Htr2 Serotonin Receptor 2A
Type:
G Protein-Coupled Receptor (GPCR)
Mol. Mass.:
52852.05
Organism:
Rattus norvegicus (rat)
Description:
Rat cortex membranes 5-HT2A receptors.
Residue:
471
  
Inhibitor
Name:
BDBM50346381
Synonyms:
CHEMBL1783352 | N'-cyano-N-(3-(4-(naphthalen-1-yl)piperazin-1-yl)propyl)isonicotinamidine
Type:
Small organic molecule
Emp. Form.:
C24H26N6
Mol. Mass.:
398.5034
SMILES:
N#CNC(=NCCCN1CCN(CC1)c1cccc2ccccc12)c1ccncc1
: