Target
L-cysteine:1D-myo-inositol 2-amino-2-deoxy-alpha-D-glucopyranoside ligase
Ligand
BDBM50347249
Substrate
Meas. Tech.
ChEMBL_754210 (CHEMBL1798854)
IC50
280000±n/a nM
Citation
 Newton, GLBuchmeier, NLa Clair, JJFahey, RC Evaluation of NTF1836 as an inhibitor of the mycothiol biosynthetic enzyme MshC in growing and non-replicating Mycobacterium tuberculosis. Bioorg Med Chem 19:3956-64 (2011)  
Target
Name:
L-cysteine:1D-myo-inositol 2-amino-2-deoxy-alpha-D-glucopyranoside ligase
Synonyms:
L-Cys:GlcN-Ins ligase MSHC_MYCTU cysS2 | mshC
Type:
PROTEIN
Mol. Mass.:
45583.42
Organism:
Mycobacterium tuberculosis
Description:
ChEMBL_754210
Residue:
414
  
Inhibitor
Name:
BDBM50347249
Synonyms:
CHEMBL1795954
Type:
Small organic molecule
Emp. Form.:
C31H34ClN3O2S
Mol. Mass.:
548.139
SMILES:
CN(CCCNC(=O)c1ccc2Sc3ccccc3C(=O)N(Cc3cccc(Cl)c3)c2c1)C1CCCCC1
: