Target
L-cysteine:1D-myo-inositol 2-amino-2-deoxy-alpha-D-glucopyranoside ligase
Ligand
BDBM50347263
Substrate
Meas. Tech.
ChEMBL_754210 (CHEMBL1798854)
IC50
100000±n/a nM
Citation
 Newton, GLBuchmeier, NLa Clair, JJFahey, RC Evaluation of NTF1836 as an inhibitor of the mycothiol biosynthetic enzyme MshC in growing and non-replicating Mycobacterium tuberculosis. Bioorg Med Chem 19:3956-64 (2011)  
Target
Name:
L-cysteine:1D-myo-inositol 2-amino-2-deoxy-alpha-D-glucopyranoside ligase
Synonyms:
L-Cys:GlcN-Ins ligase MSHC_MYCTU cysS2 | mshC
Type:
PROTEIN
Mol. Mass.:
45583.42
Organism:
Mycobacterium tuberculosis
Description:
ChEMBL_754210
Residue:
414
  
Inhibitor
Name:
BDBM50347263
Synonyms:
CHEMBL1796113
Type:
Small organic molecule
Emp. Form.:
C29H30ClN3O3S
Mol. Mass.:
536.085
SMILES:
Clc1cccc(CN2c3cc(ccc3S(=O)c3ccccc3C2=O)C(=O)NCCN2CCCCCC2)c1
: