Target
Dual specificity tyrosine-phosphorylation-regulated kinase 1A
Ligand
BDBM50347758
Substrate
Meas. Tech.
ChEMBL_756286 (CHEMBL1805099)
IC50
500±n/a nM
Citation
 Debdab, MCarreaux, FRenault, SSoundararajan, MFedorov, OFilippakopoulos, PLozach, OBabault, LTahtouh, TBaratte, BOgawa, YHagiwara, MEisenreich, ARauch, UKnapp, SMeijer, LBazureau, JP Leucettines, a class of potent inhibitors of cdc2-like kinases and dual specificity, tyrosine phosphorylation regulated kinases derived from the marine sponge leucettamine B: modulation of alternative pre-RNA splicing. J Med Chem 54:4172-86 (2011)  
Target
Name:
Dual specificity tyrosine-phosphorylation-regulated kinase 1A
Synonyms:
DYR1A_RAT Dual-specificity tyrosine-(Y)-phosphorylation regulated kinase 1A Dyrk1a
Type:
Enzyme Catalytic Domain
Mol. Mass.:
85573.59
Organism:
RAT
Description:
Dual-specificity tyrosine-(Y)-phosphorylation regulated kinase 1A 0 RAT::Q63470
Residue:
763
  
Inhibitor
Name:
BDBM50347758
Synonyms:
CHEMBL1802845
Type:
Small organic molecule
Emp. Form.:
C16H19N3O3
Mol. Mass.:
301.3404
SMILES:
CCCCNC1=NC(=Cc2ccc3OCOc3c2)C(=O)N1C
: