Target
Dual specificity protein kinase CLK3
Ligand
BDBM50347758
Substrate
Meas. Tech.
ChEMBL_756289 (CHEMBL1805102)
IC50
1100±n/a nM
Citation
 Debdab, MCarreaux, FRenault, SSoundararajan, MFedorov, OFilippakopoulos, PLozach, OBabault, LTahtouh, TBaratte, BOgawa, YHagiwara, MEisenreich, ARauch, UKnapp, SMeijer, LBazureau, JP Leucettines, a class of potent inhibitors of cdc2-like kinases and dual specificity, tyrosine phosphorylation regulated kinases derived from the marine sponge leucettamine B: modulation of alternative pre-RNA splicing. J Med Chem 54:4172-86 (2011)  
Target
Name:
Dual specificity protein kinase CLK3
Synonyms:
CDC-like kinase 3 Clk3
Type:
PROTEIN
Mol. Mass.:
73855.32
Organism:
Mus musculus
Description:
ChEMBL_1502247
Residue:
638
  
Inhibitor
Name:
BDBM50347758
Synonyms:
CHEMBL1802845
Type:
Small organic molecule
Emp. Form.:
C16H19N3O3
Mol. Mass.:
301.3404
SMILES:
CCCCNC1=NC(=Cc2ccc3OCOc3c2)C(=O)N1C
: