Target
Serine/threonine-protein kinase pim-1
Ligand
BDBM50347758
Substrate
Meas. Tech.
ChEMBL_756293 (CHEMBL1805106)
IC50
4600±n/a nM
Citation
 Debdab, MCarreaux, FRenault, SSoundararajan, MFedorov, OFilippakopoulos, PLozach, OBabault, LTahtouh, TBaratte, BOgawa, YHagiwara, MEisenreich, ARauch, UKnapp, SMeijer, LBazureau, JP Leucettines, a class of potent inhibitors of cdc2-like kinases and dual specificity, tyrosine phosphorylation regulated kinases derived from the marine sponge leucettamine B: modulation of alternative pre-RNA splicing. J Med Chem 54:4172-86 (2011)  
Target
Name:
Serine/threonine-protein kinase pim-1
Synonyms:
PIM-1 Kinase PIM1_HUMAN Serine/threonine-protein kinase (PIM1) Serine/threonine-protein kinase PIM1 | Serine/threonine-protein kinase pim-1 (PIM1)
Type:
Protein
Mol. Mass.:
35681.82
Organism:
Homo sapiens (Human)
Description:
P11309
Residue:
313
  
Inhibitor
Name:
BDBM50347758
Synonyms:
CHEMBL1802845
Type:
Small organic molecule
Emp. Form.:
C16H19N3O3
Mol. Mass.:
301.3404
SMILES:
CCCCNC1=NC(=Cc2ccc3OCOc3c2)C(=O)N1C
: