Target
Protein kinase C epsilon type
Ligand
BDBM50057512
Substrate
Meas. Tech.
ChEMBL_758031 (CHEMBL1809448)
Kd
0.810000±n/a nM
Citation
 Kawamura, TMatsubara, KOtaka, HTashiro, EShindo, KYanagita, RCIrie, KImoto, M Generation of 'Unnatural Natural Product' library and identification of a small molecule inhibitor of XIAP. Bioorg Med Chem 19:4377-85 (2011)  
Target
Name:
Protein kinase C epsilon type
Synonyms:
KPCE_HUMAN PKCE Protein kinase C epsilon Protein kinase C, PKC; classical/novel nPKC-epsilon
Type:
Enzyme
Mol. Mass.:
83680.45
Organism:
Homo sapiens (Human)
Description:
The recombinant human PKC enzymes were produced using a baculovirus expression system in SF9 cells
Residue:
737
  
Inhibitor
Name:
BDBM50057512
Synonyms:
(1aR,1bS,4aR,7aS,7bS,8R,9R,9aS)-4a,7b-dihydroxy-3-(hydroxymethyl)-1,1,6,8-tetramethyl-5-oxo-1,1a,1b,4,4a,5,7a,7b,8,9-decahydro-9aH-cyclopropa[3,4]benzo[1,2-e]azulene-9,9a-diyl dibutanoate PDBu phorbol 12,13-dibutyrate
Type:
Small organic molecule
Emp. Form.:
C28H40O8
Mol. Mass.:
504.6124
SMILES:
CCCC(=O)O[C@@H]1[C@@H](C)[C@]2(O)[C@@H]3C=C(C)C(=O)[C@@]3(O)CC(CO)=C[C@H]2[C@@H]2C(C)(C)[C@]12OC(=O)CCC
: