Target
Insulin receptor
Ligand
BDBM50348957
Substrate
Meas. Tech.
ChEMBL_758704 (CHEMBL1810156)
IC50
>40000±n/a nM
Citation
 Slavish, PJPrice, JEJiang, QCui, XMorris, SWWebb, TR Synthesis of an aryloxy oxo pyrimidinone library that displays ALK-selective inhibition. Bioorg Med Chem Lett 21:4592-6 (2011)  
Target
Name:
Insulin receptor
Synonyms:
INSR INSR_HUMAN Insulin receptor beta subunit
Type:
Receptor Tyrosine Kinase
Mol. Mass.:
156322.60
Organism:
Homo sapiens (Human)
Description:
P06213
Residue:
1382
  
Inhibitor
Name:
BDBM50348957
Synonyms:
CHEMBL1808094
Type:
Small organic molecule
Emp. Form.:
C16H14N2O4
Mol. Mass.:
298.2934
SMILES:
CC(=O)C=Cc1c(Oc2cccc(c2)C(C)=O)nc[nH]c1=O
: