Target
Insulin receptor
Ligand
BDBM50348980
Substrate
Meas. Tech.
ChEMBL_758704 (CHEMBL1810156)
IC50
>40000±n/a nM
Citation
 Slavish, PJPrice, JEJiang, QCui, XMorris, SWWebb, TR Synthesis of an aryloxy oxo pyrimidinone library that displays ALK-selective inhibition. Bioorg Med Chem Lett 21:4592-6 (2011)  
Target
Name:
Insulin receptor
Synonyms:
INSR INSR_HUMAN Insulin receptor beta subunit
Type:
Receptor Tyrosine Kinase
Mol. Mass.:
156322.60
Organism:
Homo sapiens (Human)
Description:
P06213
Residue:
1382
  
Inhibitor
Name:
BDBM50348980
Synonyms:
CHEMBL1808092
Type:
Small organic molecule
Emp. Form.:
C15H12Cl2N2O4
Mol. Mass.:
355.173
SMILES:
CCOC(=O)C=Cc1c(Oc2c(Cl)cccc2Cl)nc[nH]c1=O
: