Target
ALK tyrosine kinase receptor
Ligand
BDBM50348982
Substrate
Meas. Tech.
ChEMBL_758703 (CHEMBL1810103)
IC50
>40000±n/a nM
Citation
 Slavish, PJPrice, JEJiang, QCui, XMorris, SWWebb, TR Synthesis of an aryloxy oxo pyrimidinone library that displays ALK-selective inhibition. Bioorg Med Chem Lett 21:4592-6 (2011)  
Target
Name:
ALK tyrosine kinase receptor
Synonyms:
ALK ALK_HUMAN CD_antigen: CD246
Type:
Protein
Mol. Mass.:
176453.10
Organism:
Homo sapiens (Human)
Description:
Q9UM73
Residue:
1620
  
Inhibitor
Name:
BDBM50348982
Synonyms:
CHEMBL1808220
Type:
Small organic molecule
Emp. Form.:
C17H18N4O4
Mol. Mass.:
342.3492
SMILES:
COC(=O)c1cccc(Oc2nc[nH]c(=O)c2C2CC(C)=NN2C)c1
: