Target
ALK tyrosine kinase receptor
Ligand
BDBM50348969
Substrate
Meas. Tech.
ChEMBL_758703 (CHEMBL1810103)
IC50
9870±n/a nM
Citation
 Slavish, PJPrice, JEJiang, QCui, XMorris, SWWebb, TR Synthesis of an aryloxy oxo pyrimidinone library that displays ALK-selective inhibition. Bioorg Med Chem Lett 21:4592-6 (2011)  
Target
Name:
ALK tyrosine kinase receptor
Synonyms:
ALK ALK_HUMAN CD_antigen: CD246
Type:
Protein
Mol. Mass.:
176453.10
Organism:
Homo sapiens (Human)
Description:
Q9UM73
Residue:
1620
  
Inhibitor
Name:
BDBM50348969
Synonyms:
CHEMBL1808107
Type:
Small organic molecule
Emp. Form.:
C15H10ClF3N2O3
Mol. Mass.:
358.7
SMILES:
CC(=O)C=Cc1c(Oc2cc(ccc2Cl)C(F)(F)F)nc[nH]c1=O
: