Target
Insulin receptor
Ligand
BDBM50348952
Substrate
Meas. Tech.
ChEMBL_758704 (CHEMBL1810156)
IC50
>40000±n/a nM
Citation
 Slavish, PJPrice, JEJiang, QCui, XMorris, SWWebb, TR Synthesis of an aryloxy oxo pyrimidinone library that displays ALK-selective inhibition. Bioorg Med Chem Lett 21:4592-6 (2011)  
Target
Name:
Insulin receptor
Synonyms:
INSR INSR_HUMAN Insulin receptor beta subunit
Type:
Receptor Tyrosine Kinase
Mol. Mass.:
156322.60
Organism:
Homo sapiens (Human)
Description:
P06213
Residue:
1382
  
Inhibitor
Name:
BDBM50348952
Synonyms:
CHEMBL1808087
Type:
Small organic molecule
Emp. Form.:
C15H13ClN2O4
Mol. Mass.:
320.728
SMILES:
COc1cc(Cl)ccc1Oc1nc[nH]c(=O)c1C=CC(C)=O
: