Target
Insulin receptor
Ligand
BDBM50348953
Substrate
Meas. Tech.
ChEMBL_758704 (CHEMBL1810156)
IC50
>40000±n/a nM
Citation
 Slavish, PJPrice, JEJiang, QCui, XMorris, SWWebb, TR Synthesis of an aryloxy oxo pyrimidinone library that displays ALK-selective inhibition. Bioorg Med Chem Lett 21:4592-6 (2011)  
Target
Name:
Insulin receptor
Synonyms:
INSR INSR_HUMAN Insulin receptor beta subunit
Type:
Receptor Tyrosine Kinase
Mol. Mass.:
156322.60
Organism:
Homo sapiens (Human)
Description:
P06213
Residue:
1382
  
Inhibitor
Name:
BDBM50348953
Synonyms:
CHEMBL1808088
Type:
Small organic molecule
Emp. Form.:
C16H15ClN2O5
Mol. Mass.:
350.754
SMILES:
CCOC(=O)C=Cc1c(Oc2ccc(Cl)cc2OC)nc[nH]c1=O
: