Target
ALK tyrosine kinase receptor
Ligand
BDBM50348971
Substrate
Meas. Tech.
ChEMBL_758703 (CHEMBL1810103)
IC50
9000±n/a nM
Citation
 Slavish, PJPrice, JEJiang, QCui, XMorris, SWWebb, TR Synthesis of an aryloxy oxo pyrimidinone library that displays ALK-selective inhibition. Bioorg Med Chem Lett 21:4592-6 (2011)  
Target
Name:
ALK tyrosine kinase receptor
Synonyms:
ALK ALK_HUMAN CD_antigen: CD246
Type:
Protein
Mol. Mass.:
176453.10
Organism:
Homo sapiens (Human)
Description:
Q9UM73
Residue:
1620
  
Inhibitor
Name:
BDBM50348971
Synonyms:
CHEMBL1806514
Type:
Small organic molecule
Emp. Form.:
C18H18N4O5
Mol. Mass.:
370.3593
SMILES:
COC(=O)c1cccc(Oc2nc[nH]c(=O)c2C2CC(C)=NN2C(C)=O)c1
: