Target
ALK tyrosine kinase receptor
Ligand
BDBM50348957
Substrate
Meas. Tech.
ChEMBL_758703 (CHEMBL1810103)
IC50
6250±n/a nM
Citation
 Slavish, PJPrice, JEJiang, QCui, XMorris, SWWebb, TR Synthesis of an aryloxy oxo pyrimidinone library that displays ALK-selective inhibition. Bioorg Med Chem Lett 21:4592-6 (2011)  
Target
Name:
ALK tyrosine kinase receptor
Synonyms:
ALK ALK_HUMAN CD_antigen: CD246
Type:
Protein
Mol. Mass.:
176453.10
Organism:
Homo sapiens (Human)
Description:
Q9UM73
Residue:
1620
  
Inhibitor
Name:
BDBM50348957
Synonyms:
CHEMBL1808094
Type:
Small organic molecule
Emp. Form.:
C16H14N2O4
Mol. Mass.:
298.2934
SMILES:
CC(=O)C=Cc1c(Oc2cccc(c2)C(C)=O)nc[nH]c1=O
: