Target
ALK tyrosine kinase receptor
Ligand
BDBM50348963
Substrate
Meas. Tech.
ChEMBL_758703 (CHEMBL1810103)
IC50
10180±n/a nM
Citation
 Slavish, PJPrice, JEJiang, QCui, XMorris, SWWebb, TR Synthesis of an aryloxy oxo pyrimidinone library that displays ALK-selective inhibition. Bioorg Med Chem Lett 21:4592-6 (2011)  
Target
Name:
ALK tyrosine kinase receptor
Synonyms:
ALK ALK_HUMAN CD_antigen: CD246
Type:
Protein
Mol. Mass.:
176453.10
Organism:
Homo sapiens (Human)
Description:
Q9UM73
Residue:
1620
  
Inhibitor
Name:
BDBM50348963
Synonyms:
CHEMBL1808100
Type:
Small organic molecule
Emp. Form.:
C17H16N2O6
Mol. Mass.:
344.3187
SMILES:
COC(=O)c1ccc(OC)cc1Oc1nc[nH]c(=O)c1C=CC(C)=O
: