Target
Acetylcholinesterase
Ligand
BDBM50349921
Substrate
Meas. Tech.
ChEMBL_762161 (CHEMBL1816232)
IC50
0.8150±n/a nM
Citation
 Szymanski, PKarpinski, AMikiciuk-Olasik, E Synthesis, biological activity and HPLC validation of 1,2,3,4-tetrahydroacridine derivatives as acetylcholinesterase inhibitors. Eur J Med Chem 46:3250-7 (2011)  
Target
Name:
Acetylcholinesterase
Synonyms:
ACES_HUMAN Acetylcholinesterase (AChE) | Acetylcholinesterase (human AChE)
Type:
Enzyme
Mol. Mass.:
67792.70
Organism:
Homo sapiens (Human)
Description:
P22303
Residue:
614
  
Inhibitor
Name:
BDBM50349921
Synonyms:
CHEMBL1814729
Type:
Small organic molecule
Emp. Form.:
C22H22FN3O
Mol. Mass.:
363.428
SMILES:
Fc1ccc(cc1)C(=O)NCCNc1c2CCCCc2nc2ccccc12
: