Target
Cholinesterase
Ligand
BDBM50349922
Substrate
Meas. Tech.
ChEMBL_762162 (CHEMBL1816233)
IC50
0.0212±n/a nM
Citation
 Szymanski, PKarpinski, AMikiciuk-Olasik, E Synthesis, biological activity and HPLC validation of 1,2,3,4-tetrahydroacridine derivatives as acetylcholinesterase inhibitors. Eur J Med Chem 46:3250-7 (2011)  
Target
Name:
Cholinesterase
Synonyms:
Acylcholine acylhydrolase Butyrylcholine esterase (BChE) Butyrylcholinesterase (BuChE) CHLE_HUMAN Cholinesterases Pseudocholinesterase
Type:
Homotetramer
Mol. Mass.:
68422.27
Organism:
Homo sapiens (Human)
Description:
P06276
Residue:
602
  
Inhibitor
Name:
BDBM50349922
Synonyms:
CHEMBL1814730
Type:
Small organic molecule
Emp. Form.:
C23H24FN3O
Mol. Mass.:
377.4546
SMILES:
Fc1ccc(cc1)C(=O)NCCCNc1c2CCCCc2nc2ccccc12
: