Target
Thymidylate synthase
Ligand
BDBM50350126
Substrate
Meas. Tech.
ChEMBL_760998 (CHEMBL1815026)
Ki
3000±n/a nM
Citation
 Mangani, SCancian, LLeone, RPozzi, CLazzari, SLuciani, RFerrari, SCosti, MP Identification of the binding modes of N-phenylphthalimides inhibiting bacterial thymidylate synthase through X-ray crystallography screening. J Med Chem 54:5454-67 (2011)  
Target
Name:
Thymidylate synthase
Synonyms:
TSase Thymidylate Synthase (TS) thyA
Type:
Enzyme
Mol. Mass.:
36576.54
Organism:
Lactobacillus casei
Description:
Residue:
316
  
Inhibitor
Name:
BDBM50350126
Synonyms:
CHEMBL1231545
Type:
Small organic molecule
Emp. Form.:
C21H15NO3
Mol. Mass.:
329.3487
SMILES:
Cc1cccc2C(=O)N(C(=O)c12)c1cc(ccc1O)-c1ccccc1
: