Target
Prostaglandin D2 receptor
Ligand
BDBM50350354
Substrate
Meas. Tech.
ChEMBL_761112 (CHEMBL1815366)
IC50
0.7±n/a nM
Citation
 Iwahashi, MShimabukuro, AOnoda, TMatsunaga, YOkada, YMatsumoto, RNambu, FNakai, HToda, M Discovery of selective indole-based prostaglandin D2 receptor antagonist. Bioorg Med Chem 19:4574-88 (2011)  
Target
Name:
Prostaglandin D2 receptor
Synonyms:
PD2R_MOUSE Ptgdr
Type:
PROTEIN
Mol. Mass.:
40018.63
Organism:
Mus musculus
Description:
ChEMBL_788408
Residue:
357
  
Inhibitor
Name:
BDBM50350354
Synonyms:
CHEMBL1813277
Type:
Small organic molecule
Emp. Form.:
C28H24F2N2O5
Mol. Mass.:
506.4974
SMILES:
CN1C[C@@H](COc2ccc(C(=O)n3c(C)c(CC(O)=O)c4cc(F)ccc34)c(F)c2)Oc2ccccc12
: