Target
Prostaglandin F2-alpha receptor
Ligand
BDBM50350349
Substrate
Meas. Tech.
ChEMBL_761108 (CHEMBL1815362)
Ki
2100±n/a nM
Citation
 Iwahashi, MShimabukuro, AOnoda, TMatsunaga, YOkada, YMatsumoto, RNambu, FNakai, HToda, M Discovery of selective indole-based prostaglandin D2 receptor antagonist. Bioorg Med Chem 19:4574-88 (2011)  
Target
Name:
Prostaglandin F2-alpha receptor
Synonyms:
PF2R_MOUSE Ptgfr
Type:
Enzyme Catalytic Domain
Mol. Mass.:
40714.02
Organism:
MOUSE
Description:
ProstaglandinF2Alpha PTGFR MOUSE::P43117
Residue:
366
  
Inhibitor
Name:
BDBM50350349
Synonyms:
CHEMBL1813115
Type:
Small organic molecule
Emp. Form.:
C28H26N2O5
Mol. Mass.:
470.5164
SMILES:
CN1C[C@@H](COc2ccc(cc2)C(=O)n2c(C)c(CC(O)=O)c3ccccc23)Oc2ccccc12
: