Target
Amine oxidase [flavin-containing] A
Ligand
BDBM50350640
Substrate
Meas. Tech.
ChEMBL_762396 (CHEMBL1816569)
IC50
5850±n/a nM
Citation
 Manley-King, CIBergh, JJPetzer, JP Inhibition of monoamine oxidase by C5-substituted phthalimide analogues. Bioorg Med Chem 19:4829-40 (2011)  
Target
Name:
Amine oxidase [flavin-containing] A
Synonyms:
AOFA_HUMAN MAO-A Monoamine oxidase Monoamine oxidase type A (MAO A) Monoamine oxidase type A (MAOA)
Type:
Protein
Mol. Mass.:
59689.53
Organism:
Homo sapiens (Human)
Description:
P21397
Residue:
527
  
Inhibitor
Name:
BDBM50350640
Synonyms:
CHEMBL1813518
Type:
Small organic molecule
Emp. Form.:
C14H9NO3
Mol. Mass.:
239.2262
SMILES:
O=C1NC(=O)c2cc(Oc3ccccc3)ccc12
: