Target
Amine oxidase [flavin-containing] B
Ligand
BDBM50350641
Substrate
Meas. Tech.
ChEMBL_762397 (CHEMBL1816570)
IC50
43±n/a nM
Citation
 Manley-King, CIBergh, JJPetzer, JP Inhibition of monoamine oxidase by C5-substituted phthalimide analogues. Bioorg Med Chem 19:4829-40 (2011)  
Target
Name:
Amine oxidase [flavin-containing] B
Synonyms:
AOFB_HUMAN MAOB Monoamine oxidase type B (MAO B) Monoamine oxidase type B (MAOB)
Type:
Protein
Mol. Mass.:
58768.76
Organism:
Homo sapiens (Human)
Description:
P27338
Residue:
520
  
Inhibitor
Name:
BDBM50350641
Synonyms:
CHEMBL342357
Type:
Small organic molecule
Emp. Form.:
C15H11NO3
Mol. Mass.:
253.2527
SMILES:
O=C1NC(=O)c2cc(OCc3ccccc3)ccc12
: