Target
Amine oxidase [flavin-containing] A
Ligand
BDBM50350641
Substrate
Meas. Tech.
ChEMBL_762396 (CHEMBL1816569)
IC50
4170±n/a nM
Citation
 Manley-King, CIBergh, JJPetzer, JP Inhibition of monoamine oxidase by C5-substituted phthalimide analogues. Bioorg Med Chem 19:4829-40 (2011)  
Target
Name:
Amine oxidase [flavin-containing] A
Synonyms:
AOFA_HUMAN MAO-A Monoamine oxidase Monoamine oxidase type A (MAO A) Monoamine oxidase type A (MAOA)
Type:
Protein
Mol. Mass.:
59689.53
Organism:
Homo sapiens (Human)
Description:
P21397
Residue:
527
  
Inhibitor
Name:
BDBM50350641
Synonyms:
CHEMBL342357
Type:
Small organic molecule
Emp. Form.:
C15H11NO3
Mol. Mass.:
253.2527
SMILES:
O=C1NC(=O)c2cc(OCc3ccccc3)ccc12
: