Target
Amine oxidase [flavin-containing] B
Ligand
BDBM50350637
Substrate
Meas. Tech.
ChEMBL_762397 (CHEMBL1816570)
IC50
6.9±n/a nM
Citation
 Manley-King, CIBergh, JJPetzer, JP Inhibition of monoamine oxidase by C5-substituted phthalimide analogues. Bioorg Med Chem 19:4829-40 (2011)  
Target
Name:
Amine oxidase [flavin-containing] B
Synonyms:
AOFB_HUMAN MAOB Monoamine oxidase type B (MAO B) Monoamine oxidase type B (MAOB)
Type:
Protein
Mol. Mass.:
58768.76
Organism:
Homo sapiens (Human)
Description:
P27338
Residue:
520
  
Inhibitor
Name:
BDBM50350637
Synonyms:
CHEMBL1813523
Type:
Small organic molecule
Emp. Form.:
C15H10BrNO3
Mol. Mass.:
332.149
SMILES:
Brc1ccc(COc2ccc3C(=O)NC(=O)c3c2)cc1
: