Target
Amine oxidase [flavin-containing] B
Ligand
BDBM50350644
Substrate
Meas. Tech.
ChEMBL_762397 (CHEMBL1816570)
IC50
134000±n/a nM
Citation
 Manley-King, CIBergh, JJPetzer, JP Inhibition of monoamine oxidase by C5-substituted phthalimide analogues. Bioorg Med Chem 19:4829-40 (2011)  
Target
Name:
Amine oxidase [flavin-containing] B
Synonyms:
AOFB_HUMAN MAOB Monoamine oxidase type B (MAO B) Monoamine oxidase type B (MAOB)
Type:
Protein
Mol. Mass.:
58768.76
Organism:
Homo sapiens (Human)
Description:
P27338
Residue:
520
  
Inhibitor
Name:
BDBM50350644
Synonyms:
PHTHALIMIDE
Type:
Small organic molecule
Emp. Form.:
C8H5NO2
Mol. Mass.:
147.1308
SMILES:
O=C1NC(=O)c2ccccc12
: