Target
Xanthine dehydrogenase/oxidase
Ligand
BDBM50351344
Substrate
Meas. Tech.
ChEMBL_764381 (CHEMBL1820933)
IC50
59000±n/a nM
Citation
 Nepali, KAgarwal, ASapra, SMittal, VKumar, RBanerjee, UCGupta, MKSatti, NKSuri, OPDhar, KL N-(1,3-Diaryl-3-oxopropyl)amides as a new template for xanthine oxidase inhibitors. Bioorg Med Chem 19:5569-76 (2011)  
Target
Name:
Xanthine dehydrogenase/oxidase
Synonyms:
XDH Xanthine dehydrogenase Xanthine oxidase (XO)
Type:
Protein
Mol. Mass.:
146809.00
Organism:
Bos taurus (Bovine)
Description:
P80457
Residue:
1332
  
Inhibitor
Name:
BDBM50351344
Synonyms:
CHEMBL1818917
Type:
Small organic molecule
Emp. Form.:
C21H19NO2
Mol. Mass.:
317.3811
SMILES:
CC(=O)NC(CC(=O)c1ccccc1)c1cccc2ccccc12
: