Target
Xanthine dehydrogenase/oxidase
Ligand
BDBM50351363
Substrate
Meas. Tech.
ChEMBL_764381 (CHEMBL1820933)
IC50
22000±n/a nM
Citation
 Nepali, KAgarwal, ASapra, SMittal, VKumar, RBanerjee, UCGupta, MKSatti, NKSuri, OPDhar, KL N-(1,3-Diaryl-3-oxopropyl)amides as a new template for xanthine oxidase inhibitors. Bioorg Med Chem 19:5569-76 (2011)  
Target
Name:
Xanthine dehydrogenase/oxidase
Synonyms:
XDH Xanthine dehydrogenase Xanthine oxidase (XO)
Type:
Protein
Mol. Mass.:
146809.00
Organism:
Bos taurus (Bovine)
Description:
P80457
Residue:
1332
  
Inhibitor
Name:
BDBM50351363
Synonyms:
CHEMBL1818936
Type:
Small organic molecule
Emp. Form.:
C15H13Cl2NO2S
Mol. Mass.:
342.24
SMILES:
CC(=O)NC(CC(=O)c1cc(Cl)cs1)c1ccc(Cl)cc1
: