Target
Xanthine dehydrogenase/oxidase
Ligand
BDBM50351365
Substrate
Meas. Tech.
ChEMBL_764381 (CHEMBL1820933)
IC50
27000±n/a nM
Citation
 Nepali, KAgarwal, ASapra, SMittal, VKumar, RBanerjee, UCGupta, MKSatti, NKSuri, OPDhar, KL N-(1,3-Diaryl-3-oxopropyl)amides as a new template for xanthine oxidase inhibitors. Bioorg Med Chem 19:5569-76 (2011)  
Target
Name:
Xanthine dehydrogenase/oxidase
Synonyms:
XDH Xanthine dehydrogenase Xanthine oxidase (XO)
Type:
Protein
Mol. Mass.:
146809.00
Organism:
Bos taurus (Bovine)
Description:
P80457
Residue:
1332
  
Inhibitor
Name:
BDBM50351365
Synonyms:
CHEMBL1818938
Type:
Small organic molecule
Emp. Form.:
C15H15NO2S
Mol. Mass.:
273.35
SMILES:
CC(=O)NC(CC(=O)c1cccs1)c1ccccc1
: