Target
Prostaglandin E2 receptor EP2 subtype
Ligand
BDBM50351483
Substrate
Meas. Tech.
ChEMBL_764671 (CHEMBL1821223)
Ki
44±n/a nM
Citation
 Iwahashi, MTakahashi, ETanaka, MMatsunaga, YOkada, YMatsumoto, RNambu, FNakai, HToda, M Design and synthesis of new prostaglandin D2 receptor antagonists. Bioorg Med Chem 19:5361-71 (2011)  
Target
Name:
Prostaglandin E2 receptor EP2 subtype
Synonyms:
PE2R2_MOUSE Prostaglandin E2 Prostanoid EP2 receptor Ptgerep2
Type:
G-protein coupled receptor
Mol. Mass.:
40495.26
Organism:
Mus musculus (Mouse)
Description:
Residue:
362
  
Inhibitor
Name:
BDBM50351483
Synonyms:
CHEMBL1819622
Type:
Small organic molecule
Emp. Form.:
C25H22Cl2N2O5
Mol. Mass.:
501.359
SMILES:
CN1C[C@@H](COc2ccc(C(=O)Nc3cc(CC(O)=O)ccc3Cl)c(Cl)c2)Oc2ccccc12
: