Target
3-dehydroquinate dehydratase
Ligand
BDBM50352026
Substrate
Meas. Tech.
ChEMBL_766423 (CHEMBL1826563)
Ki
870±n/a nM
Citation
 Tizón, LOtero, JMPrazeres, VFLlamas-Saiz, ALFox, GCvan Raaij, MJLamb, HHawkins, ARAinsa, JACastedo, LGonzález-Bello, C A prodrug approach for improving antituberculosis activity of potent Mycobacterium tuberculosis type II dehydroquinase inhibitors. J Med Chem 54:6063-84 (2011)  
Target
Name:
3-dehydroquinate dehydratase
Synonyms:
AROQ_MYCTU aroQ
Type:
PROTEIN
Mol. Mass.:
15786.25
Organism:
Mycobacterium tuberculosis
Description:
ChEMBL_766423
Residue:
147
  
Inhibitor
Name:
BDBM50352026
Synonyms:
CHEMBL1823570
Type:
Small organic molecule
Emp. Form.:
C22H21O6S2
Mol. Mass.:
445.529
SMILES:
Cc1ccc2sc(CC3=C(OCc4cccs4)[C@@H](O)[C@H](O)C[C@]3(O)C([O-])=O)cc2c1
: