Target
Nitric oxide synthase, brain
Ligand
BDBM50352517
Substrate
Meas. Tech.
ChEMBL_767162 (CHEMBL1826313)
Ki
110±n/a nM
Citation
 Xue, FKraus, JMLabby, KJJi, HMataka, JXia, GLi, HDelker, SLRoman, LJMartásek, PPoulos, TLSilverman, RB Improved synthesis of chiral pyrrolidine inhibitors and their binding properties to neuronal nitric oxide synthase. J Med Chem 54:6399-403 (2011)  
Target
Name:
Nitric oxide synthase, brain
Synonyms:
Bnos NC-NOS NOS type I nNOS Neuronal nitric oxide synthase Nitric Oxide Synthase, brain Nitric oxide synthase, brain (nNOS) Nitric-oxide synthase, brain (nNOS) Nos1 | Peptidyl-cysteine S-nitrosylase NOS1
Type:
Enzyme
Mol. Mass.:
160570.98
Organism:
Rattus norvegicus (rat)
Description:
Recombinant nNOS overexpressed in E. coli was used in enzyme assays.
Residue:
1429
  
Inhibitor
Name:
BDBM50352517
Synonyms:
CHEMBL1614782
Type:
Small organic molecule
Emp. Form.:
C21H27F3N4O
Mol. Mass.:
408.4605
SMILES:
Cc1cc(N)nc(C[C@@H]2CNC[C@@H]2OCCNCC(F)(F)c2cccc(F)c2)c1
: