Target
Carbonic anhydrase 13
Ligand
BDBM50352643
Substrate
Meas. Tech.
ChEMBL_766491 (CHEMBL1826756)
pH
7.5±n/a
Ki
280±n/a nM
Comments
extracted
Citation
 Rami, MInnocenti, AMontero, JLScozzafava, AWinum, JYSupuran, CT Synthesis of rhodamine B-benzenesulfonamide conjugates and their inhibitory activity against humana- and bacterial/fungalß-carbonic anhydrases. Bioorg Med Chem Lett 21:5210-3 (2011)  
Target
Name:
Carbonic anhydrase 13
Synonyms:
CA13 Carbonic anhydrase Carbonic anhydrase XIII (CA XIII)
Type:
Enzyme
Mol. Mass.:
29445.78
Organism:
Homo sapiens (Human)
Description:
Q8N1Q1
Residue:
262
  
Inhibitor
Name:
BDBM50352643
Synonyms:
CHEMBL1822699
Type:
Small organic molecule
Emp. Form.:
C34H36N4O4S
Mol. Mass.:
596.739
SMILES:
CCN(CC)c1ccc2c(Oc3cc(ccc3C22N(C(=O)c3ccccc23)c2ccc(cc2)S(N)(=O)=O)N(CC)CC)c1
: