Target
Aminopeptidase N
Ligand
BDBM50353018
Substrate
Meas. Tech.
ChEMBL_766293 (CHEMBL1826225)
Ki
0.060000±n/a nM
Citation
 Maiereanu, CSchmitt, CSchifano-Faux, NLe Nouën, DDefoin, ATarnus, C A novel amino-benzosuberone derivative is a picomolar inhibitor of mammalian aminopeptidase N/CD13. Bioorg Med Chem 19:5716-33 (2011)  
Target
Name:
Aminopeptidase N
Synonyms:
AMPN_PIG AP-M Alanyl aminopeptidase Aminopeptidase N (APN) Microsomal aminopeptidase pAPN
Type:
Protein
Mol. Mass.:
108810.25
Organism:
Sus scrofa (Pig)
Description:
P15145
Residue:
963
  
Inhibitor
Name:
BDBM50353018
Synonyms:
CHEMBL1821980 | CHEMBL1852660
Type:
Small organic molecule
Emp. Form.:
C17H16BrNO
Mol. Mass.:
330.219
SMILES:
NC1CCc2c(Br)ccc(-c3ccccc3)c2CC1=O
: