Target
Cannabinoid receptor 1
Ligand
BDBM50353088
Substrate
Meas. Tech.
ChEMBL_767974 (CHEMBL1825303)
Ki
864000±n/a nM
Citation
 Turkman, NShavrin, AIvanov, RARabinovich, BVolgin, AGelovani, JGAlauddin, MM Fluorinated cannabinoid CB2 receptor ligands: synthesis and in vitro binding characteristics of 2-oxoquinoline derivatives. Bioorg Med Chem 19:5698-707 (2011)  
Target
Name:
Cannabinoid receptor 1
Synonyms:
CANN6 CB-R CNR CNR1_HUMAN Cannabinoid receptor Cannabinoid receptor 1 (brain)
Type:
G Protein-Coupled Receptor (GPCR)
Mol. Mass.:
52868.96
Organism:
Homo sapiens (Human)
Description:
P21554
Residue:
472
  
Inhibitor
Name:
BDBM50353088
Synonyms:
CHEMBL1822942
Type:
Small organic molecule
Emp. Form.:
C25H29FN2O4
Mol. Mass.:
440.5072
SMILES:
CCCCCc1cc2cc(C(=O)NCCc3ccc(F)cc3)c(=O)n(C)c2c(O)c1OC
: