Target
CREB-binding protein
Ligand
BDBM50353594
Substrate
Meas. Tech.
ChEMBL_770203 (CHEMBL1832993)
IC50
32200±n/a nM
Citation
 Hewings, DSWang, MPhilpott, MFedorov, OUttarkar, SFilippakopoulos, PPicaud, SVuppusetty, CMarsden, BKnapp, SConway, SJHeightman, TD 3,5-dimethylisoxazoles act as acetyl-lysine-mimetic bromodomain ligands. J Med Chem 54:6761-70 (2011)  
Target
Name:
CREB-binding protein
Synonyms:
CBP CREB-binding protein (CBP) CREBBP
Type:
Transcription Coactivator
Mol. Mass.:
265411.66
Organism:
Homo sapiens (Human)
Description:
Q92793
Residue:
2442
  
Inhibitor
Name:
BDBM50353594
Synonyms:
CHEMBL1828984
Type:
Small organic molecule
Emp. Form.:
C14H15NO4
Mol. Mass.:
261.2732
SMILES:
CCOc1cc(cc(c1)-c1c(C)noc1C)C(O)=O
: