Target
Kappa-type opioid receptor
Ligand
BDBM50026603
Substrate
Meas. Tech.
ChEMBL_771034 (CHEMBL1838556)
EC50
>10000±n/a nM
Citation
 Cami-Kobeci, GPolgar, WEKhroyan, TVToll, LHusbands, SM Structural determinants of opioid and NOP receptor activity in derivatives of buprenorphine. J Med Chem 54:6531-7 (2011)  
Target
Name:
Kappa-type opioid receptor
Synonyms:
K-OR-1 Kappa-opioid receptor (KOR) Kappa-type opioid receptor (KOR) OPIATE Kappa OPRK1 kappa opioid receptor (KOR)
Type:
G Protein-Coupled Receptor (GPCR)
Mol. Mass.:
42648.76
Organism:
Homo sapiens (Human)
Description:
P41145
Residue:
380
  
Inhibitor
Name:
BDBM50026603
Synonyms:
Buprenorphine | CHEBI:3216
Type:
Small organic molecule
Emp. Form.:
C29H41NO4
Mol. Mass.:
467.6401
SMILES:
[H][C@@]12Oc3c4c(C[C@@]5([H])N(CC6CC6)CC[C@@]14[C@@]51CC[C@@]2(OC)[C@]([H])(C1)[C@](C)(O)C(C)(C)C)ccc3O
: