Target
Nociceptin receptor
Ligand
BDBM50354576
Substrate
Meas. Tech.
ChEMBL_771035 (CHEMBL1838557)
Ki
68±n/a nM
Citation
 Cami-Kobeci, GPolgar, WEKhroyan, TVToll, LHusbands, SM Structural determinants of opioid and NOP receptor activity in derivatives of buprenorphine. J Med Chem 54:6531-7 (2011)  
Target
Name:
Nociceptin receptor
Synonyms:
KOR-3 Mu-type opioid receptor (Mu) Nociceptin Receptor (ORL1 Receptor) Nociceptin receptor (ORL-1) Nociceptin/Orphanin FQ, NOP receptor OPIATE ORL-1 OPRL1 protein ORL1 Opioid receptor like-1 Orphanin FQ receptor (ORL1) | P41146
Type:
G Protein-Coupled Receptor (GPCR)
Mol. Mass.:
40702.87
Organism:
Homo sapiens (Human)
Description:
P41146
Residue:
370
  
Inhibitor
Name:
BDBM50354576
Synonyms:
CHEMBL1834415
Type:
Small organic molecule
Emp. Form.:
C29H40ClNO4
Mol. Mass.:
502.085
SMILES:
CO[C@]12CC[C@@]3(C[C@@H]1[C@@](C)(O)C(C)(C)C)[C@H]1Cc4c5c(O[C@@H]2[C@@]35CCN1CC1CC1)c(O)cc4Cl
: