Target
Histone deacetylase 1
Ligand
BDBM50354790
Substrate
Meas. Tech.
ChEMBL_771748 (CHEMBL1838366)
IC50
11±n/a nM
Citation
 Rajak, HAgarawal, AParmar, PThakur, BSVeerasamy, RSharma, PCKharya, MD 2,5-Disubstituted-1,3,4-oxadiazoles/thiadiazole as surface recognition moiety: design and synthesis of novel hydroxamic acid based histone deacetylase inhibitors. Bioorg Med Chem Lett 21:5735-8 (2011)  
Target
Name:
Histone deacetylase 1
Synonyms:
Cereblon/Histone deacetylase 1 HDAC1 Histone deacetylase 1 (HDAC1) RPD3L1
Type:
Enzyme
Mol. Mass.:
55090.27
Organism:
Homo sapiens (Human)
Description:
Q13547
Residue:
482
  
Inhibitor
Name:
BDBM50354790
Synonyms:
CHEMBL1834470
Type:
Small organic molecule
Emp. Form.:
C13H11N7O3
Mol. Mass.:
313.2715
SMILES:
Nc1ccc(cc1)-c1nnc(Nc2ncc(cn2)C(=O)NO)o1
: