Target
Histone deacetylase 1
Ligand
BDBM50354799
Substrate
Meas. Tech.
ChEMBL_771748 (CHEMBL1838366)
IC50
8±n/a nM
Citation
 Rajak, HAgarawal, AParmar, PThakur, BSVeerasamy, RSharma, PCKharya, MD 2,5-Disubstituted-1,3,4-oxadiazoles/thiadiazole as surface recognition moiety: design and synthesis of novel hydroxamic acid based histone deacetylase inhibitors. Bioorg Med Chem Lett 21:5735-8 (2011)  
Target
Name:
Histone deacetylase 1
Synonyms:
Cereblon/Histone deacetylase 1 HDAC1 Histone deacetylase 1 (HDAC1) RPD3L1
Type:
Enzyme
Mol. Mass.:
55090.27
Organism:
Homo sapiens (Human)
Description:
Q13547
Residue:
482
  
Inhibitor
Name:
BDBM50354799
Synonyms:
CHEMBL1834479
Type:
Small organic molecule
Emp. Form.:
C13H9ClN6O2S
Mol. Mass.:
348.768
SMILES:
ONC(=O)c1cnc(Nc2nnc(s2)-c2ccccc2Cl)nc1
: