Target
B1 bradykinin receptor
Ligand
BDBM50355076
Substrate
Meas. Tech.
ChEMBL_772684 (CHEMBL1837152)
Ki
296±n/a nM
Citation
 Biswas, KPeterkin, TABryan, MCArik, LLehto, SGSun, HHsieh, FYXu, CFremeau, RTAllen, JR Discovery of potent, orally bioavailable phthalazinone bradykinin B1 receptor antagonists. J Med Chem 54:7232-46 (2011)  
Target
Name:
B1 bradykinin receptor
Synonyms:
B1 BRADYKININ B1R BK-1 receptor BRADYB1 | Bradykinin B1 receptor
Type:
Enzyme
Mol. Mass.:
40508.87
Organism:
Homo sapiens (Human)
Description:
P46663
Residue:
353
  
Inhibitor
Name:
BDBM50355076
Synonyms:
CHEMBL1835753
Type:
Small organic molecule
Emp. Form.:
C31H34N2O2
Mol. Mass.:
466.6139
SMILES:
O=C(Cc1ccc(cc1)C(=O)N[C@@H]1CCCc2cc(CN3CCCCC3)ccc12)c1ccccc1
: