Target
B1 bradykinin receptor
Ligand
BDBM50355064
Substrate
Meas. Tech.
ChEMBL_772686 (CHEMBL1837154)
IC50
1±n/a nM
Citation
 Biswas, KPeterkin, TABryan, MCArik, LLehto, SGSun, HHsieh, FYXu, CFremeau, RTAllen, JR Discovery of potent, orally bioavailable phthalazinone bradykinin B1 receptor antagonists. J Med Chem 54:7232-46 (2011)  
Target
Name:
B1 bradykinin receptor
Synonyms:
B1 BRADYKININ B1R BK-1 receptor BRADYB1 | Bradykinin B1 receptor
Type:
Enzyme
Mol. Mass.:
40508.87
Organism:
Homo sapiens (Human)
Description:
P46663
Residue:
353
  
Inhibitor
Name:
BDBM50355064
Synonyms:
CHEMBL1834616
Type:
Small organic molecule
Emp. Form.:
C32H33ClN4O2
Mol. Mass.:
541.083
SMILES:
Cc1nn(-c2ccc(cc2)C(=O)N[C@@H]2CCCc3cc(CN4CCCCC4)ccc23)c(=O)c2c(Cl)cccc12
: