Target
Adenosine receptor A1
Ligand
BDBM50355164
Substrate
Meas. Tech.
ChEMBL_772799 (CHEMBL1837538)
Ki
5550±n/a nM
Citation
 Cheong, SLDolzhenko, AVPaoletta, SLee, EPKachler, SFederico, SKlotz, KNDolzhenko, AVSpalluto, GMoro, SPastorin, G Does the combination of optimal substitutions at the C²-, N¿?¿- and N¿?¿-positions of the pyrazolo-triazolo-pyrimidine scaffold guarantee selective modulation of the human A3 adenosine receptors? Bioorg Med Chem 19:6120-34 (2011)  
Target
Name:
Adenosine receptor A1
Synonyms:
A1 adenosine receptor (hA1) AA1R_HUMAN ADORA1 Adenosine A1-receptor Adenosine receptor A1 (hA1) | Adenosine transporter (AdT)
Type:
G Protein-Coupled Receptor (GPCR)
Mol. Mass.:
36520.92
Organism:
Homo sapiens (Human)
Description:
P30542
Residue:
326
  
Inhibitor
Name:
BDBM50355164
Synonyms:
CHEMBL1834622
Type:
Small organic molecule
Emp. Form.:
C20H15ClN8O
Mol. Mass.:
418.839
SMILES:
Cn1cc2c(n1)nc(NC(=O)Nc1ccccc1)n1nc(nc21)-c1ccc(Cl)cc1
: