Target
AP2-associated protein kinase 1
Ligand
BDBM15244
Substrate
Meas. Tech.
ChEMBL_774569 (CHEMBL1908786)
Kd
>10000±n/a nM
Citation
 Davis, MIHunt, JPHerrgard, SCiceri, PWodicka, LMPallares, GHocker, MTreiber, DKZarrinkar, PP Comprehensive analysis of kinase inhibitor selectivity. Nat Biotechnol 29:1046-51 (2011)  
Target
Name:
AP2-associated protein kinase 1
Synonyms:
AAK1 Adaptor-associated kinase 1 | KIAA1048
Type:
PROTEIN
Mol. Mass.:
103884.23
Organism:
Homo sapiens (Human)
Description:
ChEMBL_774569
Residue:
961
  
Inhibitor
Name:
BDBM15244
Synonyms:
5-(2,6-dichlorophenyl)-2-(2,4-difluorophenyl)sulfanylpyrimido[1,6-b]pyridazin-6-one 5-(2,6-dichlorophenyl)-2-[(2,4-difluorophenyl)thio]-6-pyrimido[1,6-b]pyridazinone 5-(2,6-dichlorophenyl)-9-(2,4-difluorophenyl)sulfanyl-1,3,10-triazabicyclo[4.4.0]deca-2,5,7,9-tetraen-4-one VX-745 cid_3038525
Type:
Small organic molecule
Emp. Form.:
C19H9Cl2F2N3OS
Mol. Mass.:
436.262
SMILES:
Fc1ccc(Sc2ccc3c(-c4c(Cl)cccc4Cl)c(=O)ncn3n2)c(F)c1
: